{"text_format":"1","workbook":"xlsx","n_sheets":10,"sheets":["Indtastning","Resultatark","CH4 Fordøjelse","CH4 Gødning","N2O Gødning","N20 Jord","CO2 Brændsler","Reduktionstiltag","Bedriften Danmark","GWP"],"not_rendered":{"charts":0,"images":0,"macros":1,"external_links":1,"defined_names":1,"comments":0,"pivot_tables":0},"unopened":[],"bounds":{"document_bytes":16777216,"sheet_cells":100000,"rows_first":2000,"rows_last":500,"rows_between":2000,"halvings":0,"cell_chars":16384,"cell_head_chars":4096},"cells_cut":0,"cells_raw":0,"read":"whole","date_system":"1900"}

{"sheet":"Indtastning","index":0,"n_rows":158,"n_cols":19,"rows_kept":158,"cut":false,"hidden":false,"merged":[[75,2,75,4],[58,1,58,4],[6,1,6,12],[37,1,37,17],[26,1,26,17]]}
["Indtastningsark"]
[]
[]
[]
[]
["Kvæg"]
["Dyretype","Staldtype"]
["Antal producerede dyr i året","Bindestald med grebning","Bindestald med riste","Sengestald med fast gulv","Sengestald, fast drænet gulv med skraber og ajleafløb","Sengestald med spalter (kanal, linespil)","Sengestald med spalter (kanal, bagskyl eller ringkanal)","Dybstrøelse (hele arealet)","Dybstrøelse, lang ædeplads med fast gulv","Dybstrøelse, lang ædeplads med spalter (kanal, linespil)","Dybstrøelse, lang ædeplads med spalter (kanal, bagskyl eller ringkanal)","Dybstrøelse + kort ædeplads med fast gulv","Spaltegulvbokse",null,null,null,null,null,"Biogas"]
["Malkekvæg, tung race"]
["Malkekvæg, jersey"]
{"$rows_left_out":149}
{"sheet":"Resultatark","index":1,"n_rows":74,"n_cols":6,"rows_kept":74,"cut":false,"hidden":false,"merged":[]}
["Bedriftsregnskab for udledningen af drivhusgasser"]
[]
["Drivhusgasudledning i alt ",null,null,null,{"$f":"F19+F31+F43+F54","v":0},"ton CO2e"]
[]
["Tabel 1. Udledningen af metan fra fordøjelsen"]
["Dyretype",null,null,null,null,"I alt"]
[null,null,null,null,null,"ton CO2e"]
["Malkekøer",null,null,null,null,{"$f":"IFERROR('CH4 Fordøjelse'!G4*GWP!$B$2,0)","v":0}]
["Tyrekalve (0-½ år)",null,null,null,null,{"$f":"IFERROR('CH4 Fordøjelse'!G5*GWP!$B$2,0)","v":0}]
["Tyre (> ½ år)",null,null,null,null,{"$f":"IFERROR('CH4 Fordøjelse'!G6*GWP!$B$2,0)","v":0}]
{"$rows_left_out":65}
{"sheet":"CH4 Fordøjelse","index":2,"n_rows":20,"n_cols":7,"rows_kept":20,"cut":false,"hidden":false,"merged":[[1,2,1,4]]}
[]
["Karekteristika","Inputs","Normtal",null,null,"Emissionsfaktor","Total udledning"]
[null,"Antal dyr","Bruttoenergiindtag","Metankonverteringsrate","Brændværdi af 1 kg CH4 omregnet til MJ","Kg CH4/dyr/år","ton CH4"]
["Malkekøer",{"$f":"SUM(Indtastning!B9:S10)","v":0},393.09902868247775,6,55.65,{"$f":"C4*(D4/100)*(365/E4)","v":154.69665279687803},{"$f":"B4*F4/1000","v":0}]
["Tyrekalve (0-½ år)",{"$f":"SUM(Indtastning!B15:P16)","v":0},61.754437356421839,3,55.65,{"$f":"C5*(D5/100)*(365/E5)","v":12.151142660428016},{"$f":"B5*F5/1000","v":0}]
["Tyre (> ½ år)",{"$f":"SUM(Indtastning!B17:P18)","v":0},51.140427945205481,6,55.65,{"$f":"C6*(D6/100)*(365/E6)","v":20.12534361185984},0]
["Kviekalve (0-½ år)",{"$f":"SUM(Indtastning!B11:P12)","v":0},115.08849572937336,3,55.65,22.645445251332227,0]
["Kvier (> ½ år)",{"$f":"SUM(Indtastning!B13:P14)","v":0},130.23895162154199,6,55.65,{"$f":"C8*(D8/100)*(365/E8)","v":51.25306451952865},0]
["Ammekvæg",{"$f":"SUM(Indtastning!B19:P21)","v":0},163.55306266796774,6,55.65,64.363199863944175,0]
["Søer",{"$f":"SUM(Indtastning!B29:S29)","v":0},72.5720547479293,0.6,55.65,2.8559353081395358,0]
{"$rows_left_out":11}
{"sheet":"CH4 Gødning","index":3,"n_rows":229,"n_cols":24,"rows_kept":229,"cut":false,"hidden":false,"merged":[[0,2,0,4],[0,6,0,21]]}
[null,null,"Karakteristika",null,null,"Inputs","Normtal",null,null,null,null,null,null,null,null,null,null,null,null,null,null,null,"Emissionsfaktor","Totale udledninger"]
["Beskrivelse","Dyrekategori","Dyretype Dansk betegnelse","Staldtype (Engelsk)","Staldtype (Dansk)","Number of animals","Gødningstype","Gødningstype (M/S)","Ton Gødning pr dyr (m)","Tørstof pct. ","Strøelsestype","Gødningstype (M/S)3","Ton Gødning pr dyr (s)","Tørstof pct.","Dage på græs (g)","Dage på græs2","VS_housing","VSHousing ","VS_grazing","VSGrazing","MCF","B0","CH4 pr dyr","Total amount of CH4"]
["Dairy cattle","Malkekvæg","1 årsko, tung race","Tethered with urine and solid manure","Bindestald med grebning",{"$f":"IFERROR(HLOOKUP('CH4 Gødning'!$E3,Indtastning!$B$8:$P$9,2,FALSE),0)","v":0},"Staldgødning","M",11.54,0.2,"Strøelse","S",{"$f":"(1.2*365)/1000","v":0.438},0.85,18,18,{"$f":"(I3*1000)/365*J3*(365-O3)*0.8+(M3*1000)/365*N3*(365-O3)*(1-0.045/100)","v":2109.1253845342467},2044.45412465753,{"$f":"(I3*1000)/365*J3*0.8*P3","v":91.055342465753441},88.518575342465738,2,0.24,{"$f":"(R3*U3/100*0.67*V3)+(T3*U3/100*0.67*V3)","v":6.8596402031999855},{"$f":"F3*W3","v":0}]
["Dairy cattle","Malkekvæg","1 årsko, tung race","Tethered with urine and solid manure","Bindestald med grebning",{"$f":"IFERROR(HLOOKUP('CH4 Gødning'!$E4,Indtastning!$B$8:$P$9,2,FALSE),0)","v":0},"Ajle (liquid manure/urin)","M",14.95,3.4000000000000002E-2,null,null,null,null,18,18,{"$f":"(I4*1000)/365*J4*(365-O4)*0.8+(M4*1000)/365*N4*(365-O4)*(1-0.045/100)","v":386.58652054794521},341.86630136986304,{"$f":"(I4*1000)/365*J4*0.8*P4","v":20.053479452054795},17.733698630136985,6.97,0.24,4.0303104960000002,0]
["Dairy cattle","Malkekvæg","1 årsko, tung race","Tethered with slurry","Bindestald med riste",{"$f":"IFERROR(HLOOKUP('CH4 Gødning'!$E5,Indtastning!$B$8:$P$9,2,FALSE),0)","v":0},"Gylle","M",30.61,8.6999999999999994E-2,"Strøelse","S",{"$f":"1.2*365/1000","v":0.438},0.85,18,18,2379.173143438356,2387.0596786301398,105.06358356164384,106.290621369863,6.97,0.24,27.944871758328034,0]
["Dairy cattle","Malkekvæg","1 årsko, tung race","Loose-holding with beds, solid floor","Sengestald med fast gulv",{"$f":"IFERROR(HLOOKUP('CH4 Gødning'!$E6,Indtastning!$B$8:$P$9,2,FALSE),0)","v":0},"Gylle","M",30.5,0.08,"Strøelse","S",{"$f":"0.4*365/1000","v":0.14599999999999999},0.85,18,18,1973.6638953013701,2161.7178786301401,96.263013698630147,106.290621369863,6.97,0.24,25.41929494596004,0]
["Dairy cattle","Malkekvæg","1 årsko, tung race","Loose-holding with beds, slatted floor","Sengestald med spalter (kanal, linespil)",{"$f":"IFERROR(HLOOKUP('CH4 Gødning'!$E7,Indtastning!$B$8:$P$9,2,FALSE),0)","v":0},"Gylle","M",30.5,0.08,"Strøelse","S",{"$f":"0.4*365/1000","v":0.14599999999999999},0.85,18,18,1973.6638953013701,2161.7178786301401,96.263013698630147,106.290621369863,6.97,0.24,25.41929494596004,0]
["Dairy cattle","Malkekvæg","1 årsko, tung race","Loose-holding with beds, slatted floor, scrape","Sengestald med spalter (kanal, bagskyl eller ringkanal)",{"$f":"IFERROR(HLOOKUP('CH4 Gødning'!$E8,Indtastning!$B$8:$P$9,2,FALSE),0)","v":0},"Gylle","M",30.5,0.08,"Strøelse","S",0.14599999999999999,0.85,18,18,1973.6638953013701,2161.7178786301401,96.263013698630147,106.290621369863,6.97,0.24,25.41929494596004,0]
["Dairy cattle","Malkekvæg","1 årsko, tung race","Loose-holding with beds, drained floor","Sengestald, fast drænet gulv med skraber og ajleafløb",{"$f":"IFERROR(HLOOKUP('CH4 Gødning'!$E9,Indtastning!$B$8:$P$9,2,FALSE),0)","v":0},"Gylle","M",30.5,0.08,"Strøelse","S",0.14599999999999999,0.85,18,18,1973.6638953013701,2161.7178786301401,96.263013698630147,106.290621369863,6.97,0.24,25.41929494596004,0]
["Dairy cattle","Malkekvæg","1 årsko, tung race","Deep litter (all)","Dybstrøelse (hele arealet)",{"$f":"IFERROR(HLOOKUP('CH4 Gødning'!$E10,Indtastning!$B$8:$P$9,2,FALSE),0)","v":0},null,null,null,null,"Dybstrøelse","S",15.92,0.3,18,18,4538.4280208219179,5429.1739786301405,0,106.290621369863,17,0.24,151.31746030560006,0]
{"$rows_left_out":220}
{"sheet":"N2O Gødning","index":4,"n_rows":224,"n_cols":18,"rows_kept":224,"cut":false,"hidden":false,"merged":[[0,12,0,16],[0,0,0,5],[0,8,0,11]]}
["Karakteristika",null,null,null,null,null,"Inputs","Normtal (Poulsen 2015)","Direkte udledninger",null,null,null,"Indirekte udledninger",null,null,null,null,"Totale udledninger"]
["Livestock categories","Dyrekategori","Dyr","Housing type","Staldsystem","Gødningstype","Antal dyr","Kg N pr dyr (Nex)","Total N excretion (kg pr year)","Emissionsfaktor (kgN2O-N pr kg Nex) ","Total N2O-N","Total N2O direkte, kg","FracGasMS","Total N fra fordampning","Emissionsfaktor (EF4)","Total N2O-N2 kg","Total N2O indirekte, kg ","Totale udledninger"]
["dairy cattle","Malkekvæg","1 årsko, tung race","Tethered with urine and solid manure","Bindestald med grebning","Staldgødning",{"$f":"IFERROR(HLOOKUP(Tabel86[[#This Row],[Staldsystem]],Indtastning!$B$8:$P$9,2,FALSE),0)","v":0},69.66,{"$f":"G3*H3","v":0},5.0000000000000001E-3,{"$f":"I3*J3","v":0},{"$f":"K3*44/28","v":0},7.78796578787566E-2,{"$f":"Tabel86[[#This Row],[Total N excretion (kg pr year)]]*Tabel86[[#This Row],[FracGasMS]]","v":0},0.01,{"$f":"Tabel86[[#This Row],[Total N fra fordampning]]*Tabel86[[#This Row],[Emissionsfaktor (EF4)]]","v":0},{"$f":"Tabel86[[#This Row],[Total N2O-N2 kg]]*44/28","v":0},{"$f":"Tabel86[[#This Row],[Total N2O direkte, kg]]+Tabel86[[#This Row],[Total N2O indirekte, kg ]]","v":0}]
["dairy cattle","Malkekvæg","1 årsko, tung race","Tethered with urine and solid manure","Bindestald med grebning","Ajle (liquid manure/urin)",{"$f":"IFERROR(HLOOKUP(Tabel86[[#This Row],[Staldsystem]],Indtastning!$B$8:$P$9,2,FALSE),0)","v":0},58.26,0,5.0000000000000001E-3,{"$f":"I4*J4","v":0},0,7.78796578787566E-2,{"$f":"Tabel86[[#This Row],[Total N excretion (kg pr year)]]*Tabel86[[#This Row],[FracGasMS]]","v":0},0.01,{"$f":"Tabel86[[#This Row],[Total N fra fordampning]]*Tabel86[[#This Row],[Emissionsfaktor (EF4)]]","v":0},{"$f":"Tabel86[[#This Row],[Total N2O-N2 kg]]*44/28","v":0},{"$f":"Tabel86[[#This Row],[Total N2O direkte, kg]]+Tabel86[[#This Row],[Total N2O indirekte, kg ]]","v":0}]
["dairy cattle","Malkekvæg","1 årsko, tung race","Tethered with slurry","Bindestald med riste","Gylle",{"$f":"IFERROR(HLOOKUP(Tabel86[[#This Row],[Staldsystem]],Indtastning!$B$8:$P$9,2,FALSE),0)","v":0},142.16999999999999,0,5.0000000000000001E-3,0,0,7.78796578787566E-2,{"$f":"Tabel86[[#This Row],[Total N excretion (kg pr year)]]*Tabel86[[#This Row],[FracGasMS]]","v":0},0.01,{"$f":"Tabel86[[#This Row],[Total N fra fordampning]]*Tabel86[[#This Row],[Emissionsfaktor (EF4)]]","v":0},{"$f":"Tabel86[[#This Row],[Total N2O-N2 kg]]*44/28","v":0},{"$f":"Tabel86[[#This Row],[Total N2O direkte, kg]]+Tabel86[[#This Row],[Total N2O indirekte, kg ]]","v":0}]
["dairy cattle","Malkekvæg","1 årsko, tung race","Loose-holding with beds, solid floor","Sengestald med fast gulv","Gylle",{"$f":"IFERROR(HLOOKUP(Tabel86[[#This Row],[Staldsystem]],Indtastning!$B$8:$P$9,2,FALSE),0)","v":0},131.96,0,5.0000000000000001E-3,0,0,7.78796578787566E-2,{"$f":"Tabel86[[#This Row],[Total N excretion (kg pr year)]]*Tabel86[[#This Row],[FracGasMS]]","v":0},0.01,{"$f":"Tabel86[[#This Row],[Total N fra fordampning]]*Tabel86[[#This Row],[Emissionsfaktor (EF4)]]","v":0},{"$f":"Tabel86[[#This Row],[Total N2O-N2 kg]]*44/28","v":0},{"$f":"Tabel86[[#This Row],[Total N2O direkte, kg]]+Tabel86[[#This Row],[Total N2O indirekte, kg ]]","v":0}]
["dairy cattle","Malkekvæg","1 årsko, tung race","Loose-holding with beds, slatted floor","Sengestald med spalter (kanal, linespil)","Gylle",{"$f":"IFERROR(HLOOKUP(Tabel86[[#This Row],[Staldsystem]],Indtastning!$B$8:$P$9,2,FALSE),0)","v":0},137.09,0,5.0000000000000001E-3,0,0,7.78796578787566E-2,{"$f":"Tabel86[[#This Row],[Total N excretion (kg pr year)]]*Tabel86[[#This Row],[FracGasMS]]","v":0},0.01,{"$f":"Tabel86[[#This Row],[Total N fra fordampning]]*Tabel86[[#This Row],[Emissionsfaktor (EF4)]]","v":0},{"$f":"Tabel86[[#This Row],[Total N2O-N2 kg]]*44/28","v":0},{"$f":"Tabel86[[#This Row],[Total N2O direkte, kg]]+Tabel86[[#This Row],[Total N2O indirekte, kg ]]","v":0}]
["dairy cattle","Malkekvæg","1 årsko, tung race","Loose-holding with beds, slatted floor, scrape","Sengestald med spalter (kanal, bagskyl eller ringkanal)","Gylle",{"$f":"IFERROR(HLOOKUP(Tabel86[[#This Row],[Staldsystem]],Indtastning!$B$8:$P$9,2,FALSE),0)","v":0},134.53,0,5.0000000000000001E-3,0,0,7.78796578787566E-2,{"$f":"Tabel86[[#This Row],[Total N excretion (kg pr year)]]*Tabel86[[#This Row],[FracGasMS]]","v":0},0.01,{"$f":"Tabel86[[#This Row],[Total N fra fordampning]]*Tabel86[[#This Row],[Emissionsfaktor (EF4)]]","v":0},{"$f":"Tabel86[[#This Row],[Total N2O-N2 kg]]*44/28","v":0},{"$f":"Tabel86[[#This Row],[Total N2O direkte, kg]]+Tabel86[[#This Row],[Total N2O indirekte, kg ]]","v":0}]
["dairy cattle","Malkekvæg","1 årsko, tung race","Loose-holding with beds, solid floor with tilt","Sengestald, fast drænet gulv med skraber og ajleafløb","Gylle",{"$f":"IFERROR(HLOOKUP(Tabel86[[#This Row],[Staldsystem]],Indtastning!$B$8:$P$9,2,FALSE),0)","v":0},139.65,0,5.0000000000000001E-3,0,0,7.78796578787566E-2,{"$f":"Tabel86[[#This Row],[Total N excretion (kg pr year)]]*Tabel86[[#This Row],[FracGasMS]]","v":0},0.01,{"$f":"Tabel86[[#This Row],[Total N fra fordampning]]*Tabel86[[#This Row],[Emissionsfaktor (EF4)]]","v":0},{"$f":"Tabel86[[#This Row],[Total N2O-N2 kg]]*44/28","v":0},{"$f":"Tabel86[[#This Row],[Total N2O direkte, kg]]+Tabel86[[#This Row],[Total N2O indirekte, kg ]]","v":0}]
["dairy cattle","Malkekvæg","1 årsko, tung race","Deep litter (all)","Dybstrøelse (hele arealet)","Dybstrøelse",{"$f":"IFERROR(HLOOKUP(Tabel86[[#This Row],[Staldsystem]],Indtastning!$B$8:$P$9,2,FALSE),0)","v":0},151.87,0,0.01,0,0,7.78796578787566E-2,{"$f":"Tabel86[[#This Row],[Total N excretion (kg pr year)]]*Tabel86[[#This Row],[FracGasMS]]","v":0},0.01,{"$f":"Tabel86[[#This Row],[Total N fra fordampning]]*Tabel86[[#This Row],[Emissionsfaktor (EF4)]]","v":0},{"$f":"Tabel86[[#This Row],[Total N2O-N2 kg]]*44/28","v":0},{"$f":"Tabel86[[#This Row],[Total N2O direkte, kg]]+Tabel86[[#This Row],[Total N2O indirekte, kg ]]","v":0}]
{"$rows_left_out":215}
{"sheet":"N20 Jord","index":5,"n_rows":90,"n_cols":19,"rows_kept":90,"cut":false,"hidden":false,"merged":[[20,1,20,5],[20,7,20,12],[20,14,20,15],[48,2,48,3]]}
[]
[null,"kg N pr år","kg N2O-N/kg N","N2O (kt)"]
["Direkte N2O emissioner",null,null,{"$f":"D4+D5+D9+D10+D11+D12","v":0}]
["1.   Handelsgødning",{"$f":"Indtastning!B92","v":0},0.01,{"$f":"B4*C4/1000/1000*44/28","v":0}]
["2.   Organisk gødning",{"$f":"B6+B7+B8","v":0},0.01,{"$f":"B5*C5/1000/1000*44/28","v":0}]
["      a. Husdyrgødning",{"$f":"Indtastning!B93","v":0},0.01,0]
["      b. Slam",{"$f":"Indtastning!B94","v":0},0.01,0]
["      c. Andet organisk gødning",{"$f":"Indtastning!B95","v":0},0.01,0]
["3.   Gødning fra græssende dyr",{"$f":"E71","v":0},1.8025659038470001E-2,{"$f":"B9*C9/1000/1000*44/28","v":0}]
["4.   Afgrøderester",{"$f":"S44","v":0},0.01,{"$f":"B10*C10/1000/1000*44/28","v":0}]
{"$rows_left_out":81}
{"sheet":"CO2 Brændsler","index":6,"n_rows":11,"n_cols":16,"rows_kept":11,"cut":false,"hidden":false,"merged":[[0,0,0,1],[0,8,0,14],[1,5,1,7],[1,9,1,11],[1,12,1,14],[0,4,0,7]]}
["Karakteristika",null,"Input",null,"Normtal",null,null,null,"Udregninger",null,null,null,null,null,null,"Totale udledninger"]
["Brændselstype","Anlægstype","Brændstofforbrug (mængde)","Enhed","Omregningsfaktor til TJ","Emissionsfaktor (kg/TJ)",null,null,"Brændstofforbrug (TJ)","Samlede udledninger (ton)",null,null,"Samlede udledninger (ton CO2e)",null,null,"Total CO2e"]
[null,null,null,null,null,"CO2","CH4","N2O",null,"CO2","CH4","N2O","CO2","CH4","N2O"]
["Flydende brændsler","Stationære anlæg",{"$f":"Indtastning!B77","v":0},"Liter",3.5899999999999998E-5,{"$f":"76.3953608167865*1000","v":76395.360816786502},1.65248117468404,0.28794144321898002,{"$f":"C4*E4","v":0},{"$f":"$I4*F4/1000","v":0},0,0,{"$f":"J4","v":0},{"$f":"K4*GWP!$B$2","v":0},{"$f":"L4*GWP!$B$3","v":0},{"$f":"SUM(M4:O4)","v":0}]
["Faste brændsler","Stationære anlæg",{"$f":"Indtastning!B78","v":0},"Ton",2.5000000000000001E-2,{"$f":"94.6*1000","v":94600},10,1.5,{"$f":"C5*E5","v":0},0,0,0,{"$f":"J5","v":0},{"$f":"K5*GWP!$B$2","v":0},{"$f":"L5*GWP!$B$3","v":0},{"$f":"SUM(M5:O5)","v":0}]
["Naturgas","Stationære anlæg",{"$f":"Indtastning!B79","v":0},"m3",3.9900000000000001E-5,{"$f":"56.9499999999999*1000","v":56949.999999999905},107.57196986489284,0.90674952636744,{"$f":"C6*E6","v":0},0,0,0,{"$f":"J6","v":0},{"$f":"K6*GWP!$B$2","v":0},{"$f":"L6*GWP!$B$3","v":0},0]
["Benzin","Mobile anlæg",{"$f":"Indtastning!B83","v":0},"Liter",3.3000000000000003E-5,{"$f":"72.9999999999999*1000","v":72999.999999999898},160.21775726555296,1.5174986907691199,{"$f":"C7*E7","v":0},0,0,0,{"$f":"J7","v":0},{"$f":"K7*GWP!$B$2","v":0},{"$f":"L7*GWP!$B$3","v":0},{"$f":"SUM(M7:O7)","v":0}]
["Diesel","Mobile anlæg",{"$f":"Indtastning!B84","v":0},"Liter",3.5899999999999998E-5,{"$f":"73.9999999999995*1000","v":73999.999999999505},1.0708526565987899,3.2031487957284299,{"$f":"C8*E8","v":0},0,0,0,{"$f":"J8","v":0},{"$f":"K8*GWP!$B$2","v":0},{"$f":"L8*GWP!$B$3","v":0},{"$f":"SUM(M8:O8)","v":0}]
[]
[]
{"$rows_left_out":2}
{"sheet":"Reduktionstiltag","index":7,"n_rows":16,"n_cols":10,"rows_kept":16,"cut":false,"hidden":false,"merged":[[0,0,0,1]]}
["Reduktionstiltag",null,"Input data",null,"Metan","Lattergas","CO2","Total reduktion",null,"Kilde"]
["Udledningskilde","Tiltag","Input data","Enhed","Reduktion p.a., i pct","Reduktion p.a., per enhed. i ton CO2e","Reduktion p.a., per enhed i ton CO2e"]
["CH4 og N2O Gødning","Forsuret, svinegylle",{"$f":"IF(Indtastning!B142=\"ja\",SUM('CH4 Gødning'!X135,'CH4 Gødning'!X137,'CH4 Gødning'!X140,'CH4 Gødning'!X141,'CH4 Gødning'!X145,'CH4 Gødning'!X146,'CH4 Gødning'!X147,'CH4 Gødning'!X148,'CH4 Gødning'!X149,'CH4 Gødning'!X153,'CH4 Gødning'!X154,'CH4 Gødning'!X158,'CH4 Gødning'!X160)*GWP!$B$2/1000,0)","v":0},"ton CO2e ",0.6,null,null,{"$f":"E3*C3","v":0},null,"Olesen, Jørgen E.; Jørgensen, Uffe; Hermansen, John E.; Petersen, Søren O.; Eriksen, Jørgen; Søegaard, Karen; Vinther, Finn P.; Elsgaard, Lars; Lund, Peter; Nørgaard, Jan V.; Møller, Henrik B.: Effekter af tiltag til reduktion af landbrugets udledninger af drivhusgasser. DCA Rapport nr. 27. August 2013."]
["CH4 og N2O Gødning","Forsuret, kvæggylle",{"$f":"IF(Indtastning!B143=\"ja\",SUM('CH4 Gødning'!X5:X9,'CH4 Gødning'!X11,'CH4 Gødning'!X13,'CH4 Gødning'!X15,'CH4 Gødning'!X20:X24,'CH4 Gødning'!X26,'CH4 Gødning'!X28,'CH4 Gødning'!X30,'CH4 Gødning'!X34,'CH4 Gødning'!X37:X41,'CH4 Gødning'!X43,'CH4 Gødning'!X46,'CH4 Gødning'!X48,'CH4 Gødning'!X52,'CH4 Gødning'!X55:X59,'CH4 Gødning'!X61,'CH4 Gødning'!X64,'CH4 Gødning'!X66,'CH4 Gødning'!X70,'CH4 Gødning'!X73:X77,'CH4 Gødning'!X79,'CH4 Gødning'!X82,'CH4 Gødning'!X84,'CH4 Gødning'!X88,'CH4 Gødning'!X91:X95,'CH4 Gødning'!X97,'CH4 Gødning'!X100,'CH4 Gødning'!X102,'CH4 Gødning'!X106,'CH4 Gødning'!X109,'CH4 Gødning'!X111,'CH4 Gødning'!X115,'CH4 Gødning'!X117,'CH4 Gødning'!X120,'CH4 Gødning'!X122,'CH4 Gødning'!X126,'CH4 Gødning'!X128,'CH4 Gødning'!X131,'CH4 Gødning'!X133)*GWP!$B$2/1000,0)","v":0},"ton CO2e ",0.6,null,null,{"$f":"E4*C4","v":0},null,"Olesen, Jørgen E.; Jørgensen, Uffe; Hermansen, John E.; Petersen, Søren O.; Eriksen, Jørgen; Søegaard, Karen; Vinther, Finn P.; Elsgaard, Lars; Lund, Peter; Nørgaard, Jan V.; Møller, Henrik B.: Effekter af tiltag til reduktion af landbrugets udledninger af drivhusgasser. DCA Rapport nr. 27. August 2013."]
["CH4 og N2O Gødning","Biogas, svinegylle",{"$f":"IF(Indtastning!B144=\"ja\",SUM('CH4 Gødning'!X135,'CH4 Gødning'!X137,'CH4 Gødning'!X140,'CH4 Gødning'!X141,'CH4 Gødning'!X145,'CH4 Gødning'!X146,'CH4 Gødning'!X147,'CH4 Gødning'!X148,'CH4 Gødning'!X149,'CH4 Gødning'!X153,'CH4 Gødning'!X154,'CH4 Gødning'!X158,'CH4 Gødning'!X160)*GWP!$B$2/1000,0)","v":0},"ton CO2e ",0.25,null,null,{"$f":"E5*C5","v":0},null,"Mikkelsen, Mette Hjorth; Albrektsen, Rikke; Gyldenkærne, Steen: Biogasproduktions konsekvenser for drivhusgasudledning i landbruget. DCE Rapport nr. 197, 2016."]
["CH4 og N2O Gødning","Biogas, kvæggylle",{"$f":"IF(Indtastning!B145=\"ja\",SUM('CH4 Gødning'!X5:X9,'CH4 Gødning'!X11,'CH4 Gødning'!X13,'CH4 Gødning'!X15,'CH4 Gødning'!X20:X24,'CH4 Gødning'!X26,'CH4 Gødning'!X28,'CH4 Gødning'!X30,'CH4 Gødning'!X34,'CH4 Gødning'!X37:X41,'CH4 Gødning'!X43,'CH4 Gødning'!X46,'CH4 Gødning'!X48,'CH4 Gødning'!X52,'CH4 Gødning'!X55:X59,'CH4 Gødning'!X61,'CH4 Gødning'!X64,'CH4 Gødning'!X66,'CH4 Gødning'!X70,'CH4 Gødning'!X73:X77,'CH4 Gødning'!X79,'CH4 Gødning'!X82,'CH4 Gødning'!X84,'CH4 Gødning'!X88,'CH4 Gødning'!X91:X95,'CH4 Gødning'!X97,'CH4 Gødning'!X100,'CH4 Gødning'!X102,'CH4 Gødning'!X106,'CH4 Gødning'!X109,'CH4 Gødning'!X111,'CH4 Gødning'!X115,'CH4 Gødning'!X117,'CH4 Gødning'!X120,'CH4 Gødning'!X122,'CH4 Gødning'!X126,'CH4 Gødning'!X128,'CH4 Gødning'!X131,'CH4 Gødning'!X133)*GWP!$B$2/1000,0)","v":0},"ton CO2e ",0.25,null,null,{"$f":"C6*E6","v":0},null,"Mikkelsen, Mette Hjorth; Albrektsen, Rikke; Gyldenkærne, Steen: Biogasproduktions konsekvenser for drivhusgasudledning i landbruget. DCE Rapport nr. 197, 2016."]
["N2O Jord","Dyrkning af energipil, sandjord",{"$f":"Indtastning!B152","v":0},"ha.",null,0.247,null,{"$f":"C7*F7+C7*G7","v":0},null,"Olesen, Jørgen E.; Jørgensen, Uffe; Hermansen, John E.; Petersen, Søren O.; Eriksen, Jørgen; Søegaard, Karen; Vinther, Finn P.; Elsgaard, Lars; Lund, Peter; Nørgaard, Jan V.; Møller, Henrik B.: Effekter af tiltag til reduktion af landbrugets udledninger af drivhusgasser. DCA Rapport nr. 27. August 2013."]
["N2O Jord","Dyrkning af energipil, lerjord",{"$f":"Indtastning!B153","v":0},"ha.",null,0.185,null,{"$f":"C8*F8+C8*G8","v":0},null,"Olesen, Jørgen E.; Jørgensen, Uffe; Hermansen, John E.; Petersen, Søren O.; Eriksen, Jørgen; Søegaard, Karen; Vinther, Finn P.; Elsgaard, Lars; Lund, Peter; Nørgaard, Jan V.; Møller, Henrik B.: Effekter af tiltag til reduktion af landbrugets udledninger af drivhusgasser. DCA Rapport nr. 27. August 2013."]
["N2O Jord","Dyrkning af energipil, organogenjord",{"$f":"Indtastning!B154","v":0},"ha.",null,0.247,null,{"$f":"C9*F9+C9*G9","v":0},null,"Olesen, Jørgen E.; Jørgensen, Uffe; Hermansen, John E.; Petersen, Søren O.; Eriksen, Jørgen; Søegaard, Karen; Vinther, Finn P.; Elsgaard, Lars; Lund, Peter; Nørgaard, Jan V.; Møller, Henrik B.: Effekter af tiltag til reduktion af landbrugets udledninger af drivhusgasser. DCA Rapport nr. 27. August 2013."]
["N2O Jord","Nitrifikationshæmmere, handelsgødning",{"$f":"IF(Indtastning!B149=\"ja\",Indtastning!B92,0)/1000","v":0},"ton handelsgødning",null,1.78,null,{"$f":"C10*F10","v":0},null,"Olesen, Jørgen E.; Jørgensen, Uffe; Hermansen, John E.; Petersen, Søren O.; Eriksen, Jørgen; Søegaard, Karen; Vinther, Finn P.; Elsgaard, Lars; Lund, Peter; Nørgaard, Jan V.; Møller, Henrik B.: Effekter af tiltag til reduktion af landbrugets udledninger af drivhusgasser. DCA Rapport nr. 27. August 2013."]
{"$rows_left_out":7}
{"sheet":"Bedriften Danmark","index":8,"n_rows":158,"n_cols":19,"rows_kept":158,"cut":false,"hidden":false,"merged":[[58,1,58,4],[75,2,75,4],[6,1,6,12],[37,1,37,17],[26,1,26,17]]}
["Indtastningsark"]
[]
[]
[]
[]
["Kvæg"]
["Dyretype","Staldtype"]
["Antal producerede dyr i året","Bindestald med grebning","Bindestald med riste","Sengestald med fast gulv","Sengestald, fast drænet gulv med skraber og ajleafløb","Sengestald med spalter (kanal, linespil)","Sengestald med spalter (kanal, bagskyl eller ringkanal)","Dybstrøelse (hele arealet)","Dybstrøelse, lang ædeplads med fast gulv","Dybstrøelse, lang ædeplads med spalter (kanal, linespil)","Dybstrøelse, lang ædeplads med spalter (kanal, bagskyl eller ringkanal)","Dybstrøelse + kort ædeplads med fast gulv","Spaltegulvbokse",null,null,null,null,null,"Biogas"]
["Malkekvæg, tung race",15753.668000000001,24193.132999999994,84394.65,22505,206434,120965.66499999999,16878.929999999997,3375.7859999999996,7314.2030000000004,5063.6789999999992,null,null,null,null,null,null,null,55752.000145511163]
["Malkekvæg, jersey"]
{"$rows_left_out":149}
{"sheet":"GWP","index":9,"n_rows":3,"n_cols":3,"rows_kept":3,"cut":false,"hidden":false,"merged":[]}
["Drivhusgas","Global warming potential (omregningsfaktor til CO2e)","Kilde"]
["Metan",25,"IPCC https://www.ipcc.ch/publications_and_data/ar4/wg1/en/ch2s2-10-2.html"]
["Lattergas",298,"IPCC https://www.ipcc.ch/publications_and_data/ar4/wg1/en/ch2s2-10-2.html"]